BDBM50296520 3-(2-hydroxy-2-methylpropoxy)-4-methoxy-N-(5-(3-(trifluoromethyl)benzyl)thiazol-2-yl)benzamide::CHEMBL559107
SMILES COc1ccc(cc1OCC(C)(C)O)C(=O)Nc1ncc(Cc2cccc(c2)C(F)(F)F)s1
InChI Key InChIKey=IGQIGUXVLYXIBZ-UHFFFAOYSA-N
Data  1 IC50
  Tab Delimited (TSV)   2D SDfile   Computed 3D by Vconf -m prep SDfile
Find this compound or compounds like it in BindingDB:
Activity Spreadsheet -- Enzyme Inhibition Constant Data from BindingDB
Found 1 hit for monomerid = 50296520
TargetAcyl-CoA desaturase 1(Mus musculus)
Daiichi Sankyo
Curated by ChEMBL
LigandPNGBDBM50296520(3-(2-hydroxy-2-methylpropoxy)-4-methoxy-N-(5-(3-(t...)
Affinity DataIC50: >1.00E+4nM. Assay description: Inhibition of SCD1 in mouse microsomes assessed as conversion of [14C]stearate to [14C]oleate after 60 mins
In DepthDetails ArticlePubMed